Nmake Fatal Error U1077 Return Code 0x1

RECOMMENDED: If you have Windows errors then we strongly recommend that you download and run this (Windows) Repair Tool.

2010年5月9日. masm: 6.00.8168.0. ActivePerl,MASM, VC6.0均已安装且bin目录都在PATH环境 变量中. 一、 NMAKE : fatal error U1077: 'ml' : return code '0x1'.

NMAKE Fatal Error U1000. NMAKE Fatal Error U1077. The latest version of this topic can be found at NMAKE Fatal Error U1077. program' : return code 'value'

cd’ : return code ‘0x1’ Stop. NMAKE : fatal error U1077: ‘"C:Program Files (x86)Microsoft Visual Studio 12.0VCBINnmake.exe"’ : return code ‘0x2’ Stop. NMAKE : fatal error U1077: ‘"C:Program Files (x86)Microsoft.

I’ve searched online and couldn’t find anything that resembled to my issue. I created an empty C++ project and added a main.cpp with a return and I can’t get it to build.

I'm trying to follow steps explained here: but after entering the following into console: configure.exe -release -no-webkit -no-phonon -no-phonon-backend -no-script.

Curl: Re: [RELEASE] curl and libcurl 7.49.0 – May 19, 2016. NMAKE : fatal error U1077: '"C:Program Files (x86)Microsoft Visual Studio 14.0 VCBINcl.exe"' : return code '0x1' Stop. I have to manually.

I am trying to compile Wireshark on Windows and I am running into the following error: NMAKE : fatal error U1077: ‘sed’ : return code ‘0x1’ I have followed all of the steps in the developer guide for setting up my environment and I haven’t.

I am trying to install Qt evaluation version 3.3.1 and I get the following error during the installion, on step 8, when Qt build it exemples. Here is what I get : NMAKE -f Makefile Microsoft (R) Program Maintenance Utility Version 6.00.8168.0.

The Win32 OpenSSL Installation Project is dedicated to providing a simple installation of OpenSSL. It is easy to set up and easy to use through the simple, effective.

Precompiled static and dynamic Qt4 and Qt5 libraries, with MySQL and OpenSSL support!

NMAKE : fatal error U1077: ‘C:Program’ : return code ‘0x1’ Stop. The make command returned an error of 2 ‘An_error_occurred_during_the_call_to_make’ is not recognized as an internal or external command, operable program.

Figure out which of the test scripts failed. If, for example, it was "FAILED.t", then run: perl -Iblib/lib -Iblib/arch -d t/FAILED.t and single-step (via the debugger’s "s" command) through the test script to see what is being tested, which ones are.

It said it needed make so I got Nmake as per your instructions. similar error " NMAKE : fatal error U1077: 'C:WINDOWSsystem32cmd.exe' : return code '0x1'".

Apr 28, 2016. The filename, directory name, or volume label syntax is incorrect. NMAKE : fatal error U1077: 'if' : return code '0x1' Stop. NMAKE : fatal error.

NMAKE : fatal error U1077: '"C:Program Files (x86)RationalRose RealTimebin win32rtperl.EXE"' : return code '0x1'. Stop. Error: Build failed.

Windows Explorer Needs To Close Error Disabling the F3 Search Key. Added 1/20/03. If you want to disable the ability to use the F3 key from either the Windows Explorer or Internet Explorer Hello, I have been attempting to search for other people with a similar problem, and so far haven't found anything related to my specific situation. I have found

I am unable to build wireshark from the released source. I found a few references to this error but none were resolved. The source is version 1.4.4. Please help. A.

Problem in Installation of opensource version of QT – Installing. – then tried to run that one then its giving the following error that i am including for your. NMAKE : fatal error U1077: 'g++' : return code '0x1'

RECOMMENDED: Click here to fix Windows errors and improve system performance