Gcc Error Stray 302

Stray Error Arduino - How to fix Stray Error in Arduino??

RECOMMENDED: If you have Windows errors then we strongly recommend that you download and run this (Windows) Repair Tool.

もし、コンパイル・リンクの時にエラー(Error)や警告(Warning)メッセージが表示された 場合. 具体的には gcc では次のエラーは、以下のような意味を表します。 sample1.c.

The Nirmal Project Implementation Unit (PIU) of the National Highways Authority of India (NHAI) has under its jurisdiction the 302-km road between the inter-State bridge on Penganga river on Adilabad-Maharashtra border and Gundla.

Reply Elham says: February 26, high vanadyl phosphate NMR chemical shifts? Browse other questions tagged c++ text Blogger. It would be better to replace Gcc Error.

This is the mail archive of the [email protected] mailing list for the GCC project. Index Nav: [Subject Index. Re: Stray \302 error. From:.

stray '240' in programのエラーとは? -stray '240' in programstra- C. – stray '240' in programstray '302' in programとはどのような意味でしょうか?ソース とか掲示. 2 error C2143: 構文エラー : ';' が '{' の前にありません。

This is the mail archive of the [email protected] mailing list for the GCC project.

9 май 2015. error: stray '302' in program. avr/include/stdint.h:159: error: 'int8_t' does not name a type c:/users/user/desktop/progect/ks0108 arduino oscilloscope/arduino- 0023/hardware/tools/avr/lib/gcc/././avr/include/stdint.h:213:.

Error Trigger Raised Unhandled Exception Net Use Error 67 Pe webdav installation on IIS7.error 67 [Answered] RSS. 21 replies Last post May 26, 2011 01:17 PM by uwking. I didn't map using the net use command, Aug 03, 2017  · Parsley Energy, Inc. (NYSE:PE)Q2 2017 Earnings CallAugust 03, 2017 11:00 am ETExecutivesBrad C. Smith – Parsley Energy, Inc.Bryan Sheffield – Parsley.

I'm using Code::Blocks on Ubuntu 10.10. I have connected a Mac keyboard and set the keyboard settings to "Swiss German Mac". Now whenever I write an equals sign.

Subject: Re: gcc error: stray `/` in program; From: Carl Thompson <cet at carlthompson dot net> Date: Mon, 12 Jun 2000 14:47:18 -0700;

How After-Market Exhaust Systems Can Disrupt Your. – How After-Market Exhaust Systems Can Disrupt Your Car’s Power Curve

Fix Kernel32.dll Error When you click the Details button, you’ll find this more specific description of the error: MSINFO32 caused an invalid page fault in module KERNEL32.DLL at 015f. that you can easily replace System Information’s executable file. What does a ”module kernel32.dll” error mean? I seem to keep getting it in Microsoft. Removing and then reinstalling Word

The second-most valuable cryptocurrency Ether — sometimes known as ‘Ethereum’, after the project behind it — was trading slightly down on the day at $302 per coin, having hit a record high of more than $410 in June.

Several recent events have heightened longstanding tensions in Qatar’s relations with three other members of the Gulf Cooperation Council (GCC): Bahrain, Saudi Arabia and the United Arab Emirates (UAE). Consistent with their.

May 28, 2016. C:Documents and SettingsMichaelMy DocumentsArduinolibrariesBME280/ Adafruit_Sensor.h:26:5: error: stray '302' in program

We would like to show you a description here but the site won’t allow us.

gcc: error: stray '342' in program. Posted on April 17, 2008 by giannis. Lately I have been worried about a strange error message I have been getting from gcc.

Net Use Error 67 Pe webdav installation on IIS7.error 67 [Answered] RSS. 21 replies Last post May 26, 2011 01:17 PM by uwking. I didn't map using the net use command, Aug 03, 2017  · Parsley Energy, Inc. (NYSE:PE)Q2 2017 Earnings CallAugust 03, 2017 11:00 am ETExecutivesBrad C. Smith – Parsley Energy, Inc.Bryan Sheffield – Parsley. Itunes Remote Speaker Error or

Express Helpline- Get answer of your question fast from real experts.

No more missed important software updates! UpdateStar 11 lets you stay up to date and secure with the software on your computer.

RECOMMENDED: Click here to fix Windows errors and improve system performance