Error Unable To Execute Mpasmwin Build Failed

RECOMMENDED: If you have Windows errors then we strongly recommend that you download and run this (Windows) Repair Tool.

MPLAB IDE v8.20 and later recognize the COFF output of MPASM in absolute mode, ( MPASM-361): Build error in the include file when using PIC12C671. (MPASM-372): MPASM fails to set MSB for Extended 16F1xxx devices for indirect addressing. To invoke the assembler from the command line, execute either:.

CSS3115 "@font-face unable to load invalid OpenType font." The font-face is not valid for this use. Get the permission or licenses for the current and valid font-face. CSS3116 "@font-face failed cross. process or a build system error.

On the toolbar, click on "Run", select "Set Project Configuration" and then click on "Customize". RunSetProjectConfiguration.png. MPASMWIN. 1. General.

Home > Unable To > Unable To Execute Mpasmwin.error 118. BUILD FAILED: Mon Nov 28 22:51:51 2005 The prefix -a directs the use of mpasmwin as the assembler.

Stellarium Runtime Error By default, StelFileMgr will be created with the Stellarium installation directory config_root in the search path. std::runtime_error : Feb 27, 2008. Either syntax error or runtime error will be throw to standard output through python exception handler by default. Python throw the exception. Visual C++ runtime error and. The problem is with the display drivers

Unable to execute mpasmwin – MELabs PICBASIC – ERROR: Unable to execute mpasmwin. BUILD FAILED : Thu Nov 02 16:18. Just getting started again with PBP3 on W 10 and I am unable to fix this darn 'unable to.

I don’t think it was bad, per se, I just think it failed on a few key points. I’d.

Insurance Companies – In theory, a microcaptive could be run in the manner of the captives in [the large.

. when in MPLAB IDE the error message received is "Unable to execute mpasmwin" BUILD HALTED. PicBasicPro Compiler Error 2005/11/28 21:10:10. BUILD FAILED.

Frame Rate Error Buy & hold investors tacitly ignore the risk component, and instead make the following calculation: “I’m not skilled enough to know when the market is too high or too low, so I’ll just ride the waves and assume that over a long enough time. How is an FER measurement made? Frame Error Rate (FER) measurement

Home > Unable To > Unable To Execute Mpasmwin.error 118 Unable To Execute Mpasmwin. FAILED hope this. received is "Unable to execute mpasmwin" BUILD.

Liverpool – The Reds dominated but didn’t take their chances and handed the opposition a.

Executing: "C:Program FilesMicrochipMPASM SuiteMPASMWIN.exe" /q / p16F88. Release build of project `C:GHWT MIDImidi.mcp' failed.

When I build (Project > Build All) I got these error:. NunchuckMousesystemusb usbmmap.c:152:Error [1027] unable to locate 'systemtypedefs.h'. Language tool versions: mpasmwin.exe v5.33, mplink.exe v4.33, mcc18.exe v3.33. Executing: "C:MCC18binmcc18.exe" -p=18F2550. BUILD FAILED.

RECOMMENDED: Click here to fix Windows errors and improve system performance