C Error C2061 Syntax Error Identifier

RECOMMENDED: If you have Windows errors then we strongly recommend that you download and run this (Windows) Repair Tool.

I try to reference a struct from another class in my code and it gives me an error, saying I have a syntax problem. #pragma once #include "Definitions.h" #include "GV.

Feb 12, 2017. 1>c:objectarxincacprofile.h(91): error C2061: syntax error : identifier 'IUnknown' 1>c:objectarxincacprofile.h(93): error C2061: syntax error.

Many thanks Barry for your reply. Tried to add objbase.h in front of the include for oledlg.h, but I was not allowed to do so as I don't access to C:\Program Files.

Compiling mex on Windows: error C2061 – mex sfun_PhaseSpaceC.c libowlsock.so sfun_PhaseSpaceC.c C:UserswestDocumentsPhaseSpacesoftwarephasespaces_function_exampleincludesowl.h(229) : error C2061:.

Here is my C++ code // XuatChuoiBTHang.h #pragma once #include. and not only for string identifier for example error C2146: syntax error : missing ‘;’ before identifier. I have searched in the Net a solution to this problem, but,

Jan 8, 2015. [SOLVED] Nested #include seems to be causing errors with C++. Error 1 error C2143: syntax error : missing ';' before '*' (.ClassesPrisoner.cpp). 17 1 PrisonBreak > Error 9 error C2061: syntax error : identifier 'Point' (.

The latest version of this topic can be found at Compiler Error C2061. syntax error : identifier 'identifier' The compiler found an identifier where it wasn't expected.

Purpose The purpose of this C++11 FAQ is To give an overview of the new facilities (language features and standard libraries) offered by C++11 in addition to what is.

Here is my C++ code // XuatChuoiBTHang.h #pragma once #include "BieuThuc.h" #include "BieuThucHang.h" class XuatChuoiBTHang { public: virtual string.

Stack Overflow is a community of 7.6 million programmers, just like you, helping each other. Join them; it only takes a minute:

Explanation. The typedef specifier, when used in a declaration’s decl-specifier-seq, specifies that the declaration is a typedef declaration, and declares typedef.

. Microsoft Visual Studio 10.0VCinclude" /I "C:Program FilesMySQLMySQL Server 5.5include" mysql1.c 2. error C2061: syntax error : identifier ‘SOCKET’ This was actually a small slew of simple syntax errors. I could tell it.

C:Program Files (x86)Microsoft Visual Studio. Visual Studio 12.0VCINCLUDE cmath(23) : error C2061: syntax error : identifier 'abs'.

One suggests to use AFX.h, another suggest us #include <stdafx.h> but my project already have #include <stdafx.h> and it also having #include <windows.h>, and I also tried #include "fstream.h" ; However still I am getting compilation.

Understandable C++ tutorials (covers most of basic C, except i/o). Includes basics, pointers, arrays, classes and structs, recursion, linked lists, encryption, OpenGL.

Narue 5,707 7 Years Ago. Mixing C++/CLI and standard C++ can be troublesome. Try sticking to one or the other unless you have good reason.

Error Message; Compiler Error C2000: UNKNOWN ERROR Please choose the Technical Support command on the Visual C++ Help menu, or open the Technical Support help file.

Jan 3, 2017. C:Program Files (x86)Windows Kits10include10.0.10240.0ucrtinttypes.h(26): error C2061: syntax error: identifier 'intmax_t'. I finally decided to edit this file and to add just before the line of the error (which I'll remove after):.

Help With Win Xp Home Stop Error Messages I had XP installed (successfully) on my machine and recently tried to upgrade my SCSI hard disk. All was going fine and appeared great until suddenly. PhoneDog Media is home to PhoneDog, Android & Me. While the name is. Aug 13, 2007. Error Message: Windows XP Requires a Hard Drive Volume with at Least 318

error C2061: syntax error : identifier. C / C++ Forums on Bytes.

C:Program Files (x86)Microsoft Visual Studio 14.0VCincludetuple(424):. error C2061: syntax error: identifier 'value' (compiling source file.

RECOMMENDED: Click here to fix Windows errors and improve system performance